Something went wrong. Try again.
A charm-like tui library
Something went wrong. Try again.
123456789101112131415161718192021222324252627282930313233343536373839404142434445464748495051525354test+- run test infrared +- compile test infrared Debug native 3 errors/nix/store/kbb1kfzlvqiwbcpw4sd2j3v63vqab3vg-zig-0.16.0/lib/zig/compiler/test_runner.zig:566:55: error: expected type '*const debug.StackTrace', found '*builtin.StackTrace' std.debug.writeStackTrace(trace, stderr) catch break :p; ^~~~~/nix/store/kbb1kfzlvqiwbcpw4sd2j3v63vqab3vg-zig-0.16.0/lib/zig/compiler/test_runner.zig:566:55: note: pointer type child 'builtin.StackTrace' cannot cast into pointer type child 'debug.StackTrace'/nix/store/kbb1kfzlvqiwbcpw4sd2j3v63vqab3vg-zig-0.16.0/lib/zig/std/builtin.zig:11:24: note: struct declared herepub const StackTrace = struct { ^~~~~~/nix/store/kbb1kfzlvqiwbcpw4sd2j3v63vqab3vg-zig-0.16.0/lib/zig/std/debug.zig:604:24: note: struct declared herepub const StackTrace = struct { ^~~~~~/nix/store/kbb1kfzlvqiwbcpw4sd2j3v63vqab3vg-zig-0.16.0/lib/zig/std/debug.zig:824:28: note: parameter type declared herepub fn writeStackTrace(st: *const StackTrace, t: Io.Terminal) Writer.Error!void { ^~~~~~~~~~~~~~~~~referenced by: fuzz__anon_44284: /nix/store/kbb1kfzlvqiwbcpw4sd2j3v63vqab3vg-zig-0.16.0/lib/zig/compiler/test_runner.zig:589:41 fuzz [inlined]: /nix/store/kbb1kfzlvqiwbcpw4sd2j3v63vqab3vg-zig-0.16.0/lib/zig/std/testing.zig:1232:32 test.fuzz width: infrared/width.zig:272:15 2 reference(s) hidden; use '-freference-trace=5' to see all references/nix/store/kbb1kfzlvqiwbcpw4sd2j3v63vqab3vg-zig-0.16.0/lib/zig/compiler/test_runner.zig:566:55: error: expected type '*const debug.StackTrace', found '*builtin.StackTrace' std.debug.writeStackTrace(trace, stderr) catch break :p; ^~~~~/nix/store/kbb1kfzlvqiwbcpw4sd2j3v63vqab3vg-zig-0.16.0/lib/zig/compiler/test_runner.zig:566:55: note: pointer type child 'builtin.StackTrace' cannot cast into pointer type child 'debug.StackTrace'/nix/store/kbb1kfzlvqiwbcpw4sd2j3v63vqab3vg-zig-0.16.0/lib/zig/std/builtin.zig:11:24: note: struct declared herepub const StackTrace = struct { ^~~~~~/nix/store/kbb1kfzlvqiwbcpw4sd2j3v63vqab3vg-zig-0.16.0/lib/zig/std/debug.zig:604:24: note: struct declared herepub const StackTrace = struct { ^~~~~~/nix/store/kbb1kfzlvqiwbcpw4sd2j3v63vqab3vg-zig-0.16.0/lib/zig/std/debug.zig:824:28: note: parameter type declared herepub fn writeStackTrace(st: *const StackTrace, t: Io.Terminal) Writer.Error!void { ^~~~~~~~~~~~~~~~~/nix/store/kbb1kfzlvqiwbcpw4sd2j3v63vqab3vg-zig-0.16.0/lib/zig/compiler/test_runner.zig:566:55: error: expected type '*const debug.StackTrace', found '*builtin.StackTrace' std.debug.writeStackTrace(trace, stderr) catch break :p; ^~~~~/nix/store/kbb1kfzlvqiwbcpw4sd2j3v63vqab3vg-zig-0.16.0/lib/zig/compiler/test_runner.zig:566:55: note: pointer type child 'builtin.StackTrace' cannot cast into pointer type child 'debug.StackTrace'/nix/store/kbb1kfzlvqiwbcpw4sd2j3v63vqab3vg-zig-0.16.0/lib/zig/std/builtin.zig:11:24: note: struct declared herepub const StackTrace = struct { ^~~~~~/nix/store/kbb1kfzlvqiwbcpw4sd2j3v63vqab3vg-zig-0.16.0/lib/zig/std/debug.zig:604:24: note: struct declared herepub const StackTrace = struct { ^~~~~~/nix/store/kbb1kfzlvqiwbcpw4sd2j3v63vqab3vg-zig-0.16.0/lib/zig/std/debug.zig:824:28: note: parameter type declared herepub fn writeStackTrace(st: *const StackTrace, t: Io.Terminal) Writer.Error!void { ^~~~~~~~~~~~~~~~~error: 3 compilation errorsfailed command: /nix/store/kbb1kfzlvqiwbcpw4sd2j3v63vqab3vg-zig-0.16.0/bin/zig test -ffuzz -ODebug -Mroot=/home/ben/Projects/hex/infrared/root.zig --cache-dir .zig-cache --global-cache-dir /home/ben/.cache/zig --name infrared --zig-lib-dir /nix/store/kbb1kfzlvqiwbcpw4sd2j3v63vqab3vg-zig-0.16.0/lib/zig/ --listen=-
error: one or more unit tests failed to be rebuilt in fuzz modeerror: the following build command failed with exit code 1:.zig-cache/o/8220c69875f36d6feb70c4a52bccb6c8/build /nix/store/kbb1kfzlvqiwbcpw4sd2j3v63vqab3vg-zig-0.16.0/bin/zig /nix/store/kbb1kfzlvqiwbcpw4sd2j3v63vqab3vg-zig-0.16.0/lib/zig /home/ben/Projects/hex .zig-cache /home/ben/.cache/zig --seed 0xdc2f9b02 -Z8b7ba6d1a625dc64 test --fuzz=2000